Укажите отработанное время

Отработанное время:
Продуктивное время:
Bug 1218 - Сборка для Special проваливается   Make a simular bug
Summary: Сборка для Special проваливается
Status: DEFERRED
Alias: None
Product: WINE@Etersoft
Classification: Продукты (Products)
Component: Общее (show other bugs)
Version: 1.0.9
Hardware: PC MCBC
: P5 minor
Target Milestone: ---
Assignee: BUGS@Etersoft
QA Contact:
URL:
Whiteboard:
Keywords:
Depends on:
Blocks: 3000
  Show dependency treegraph
 
In work:
Reported: 2008-02-27 22:40 MSK by Vitaly Lipatov
Modified: 2012-01-09 18:12 MSK (History)
3 users (show)

See Also:
Заявки RT:
Связано с:
Дата напоминания:


Attachments

Note You need to log in before you can comment on or make changes to this bug.
Description Vitaly Lipatov 2008-02-27 22:40:38 MSK
dinput_main.c: In function `_dump_diactionformatA':
dinput_main.c:226: structure has no member named `lptszActionName'
make[2]: *** [dinput_main.o] Error 1
make[2]: Leaving directory `/home/lav/RPM/BUILD/wine-20080222/dlls/dinput'
make[1]: *** [dinput] Error 2
make[1]: *** Waiting for unfinished jobs....
Comment 1 Vitaly Lipatov 2008-06-22 14:00:11 MSD
gcc -c -I. -I. -I../../include -I../../include  -D__WINESRC__ -DCOM_NO_WINDOWS_H -D_REENTRANT -fPIC -Wall -pipe -fno-strict-aliasing -Wwrite-strings -Wpointer-
arith  -O2  -o htmldoc5.o htmldoc5.c
htmldoc.c: In function `HTMLDocument_get_title':
htmldoc.c:387: parse error before `szChar'
htmldoc.c:389: `szChar' undeclared (first use in this function)
htmldoc.c:389: (Each undeclared identifier is reported only once
htmldoc.c:389: for each function it appears in.)
htmldoc.c: In function `HTMLDocument_write':
htmldoc.c:736: warning: passing arg 1 of `SysAllocString' from incompatible pointer type
htmldoc.c:742: warning: passing arg 1 of `SysAllocString' from incompatible pointer type
htmldoc.c: In function `HTMLDocument_open':
htmldoc.c:771: warning: unused variable `This'
make[2]: *** [htmldoc.o] Error 1
make[2]: *** Waiting for unfinished jobs..
Comment 2 Vitaly Lipatov 2008-09-18 20:31:21 MSD
Теперь
In file included from name.c:42:
dnsapi.h:155: parse error before `ns_msg'
dnsapi.h:156: parse error before `*'
Comment 3 Vitaly Lipatov 2009-07-26 19:50:14 MSD
Изменениями в etersoft-build-utils (замена readlink на ls) исправлена сборка закрытой части.
Теперь проблема с
device.c: In function `d3d10_device_set_rtdesc_from_resource':
device.c:761: structure has no member named `Texture1D'
(опять забытый именованный union?)
Comment 4 Vitaly Lipatov 2012-01-09 18:12:12 MSK
Откладываем, на bugs@lists.etersoft.ru не должно висеть багов.